Reaction Details
TargetSmoothened homolog
LigandBDBM50343200
Substrate/Competitorn/a
Meas. Tech.ChEMBL_1510377 (CHEMBL3607127)
IC50 120±n/a nM
Citation Yang, ZMa, HSun, ZLuo, LTian, SZheng, JZhang, X Discovery of a 6-(pyridin-3-yl)benzo[d]thiazole template for optimization of hedgehog and PI3K/AKT/mTOR dual inhibitors. Bioorg Med Chem Lett25:3665-70 (2015) 
 
Smoothened homolog
Name:Smoothened homolog
Type:PROTEIN
Mol. Mass.:87472.73
Organism:Mus musculus
Description:ChEMBL_1510377
Residue:793
BDBM50343200
NameBDBM50343200
Synonyms:CHEMBL1615189 N-[6-(6-chloro-5-{[(4-fluorophenyl)sulfonyl]amino}pyridin-3-yl)-1,3-benzothiazol-2-yl]acetamide
TypeSmall organic molecule
Emp. Form.C20H14ClFN4O3S2
Mol. Mass.476.932
SMILESCC(=O)Nc1nc2ccc(cc2s1)-c1cnc(Cl)c(NS(=O)(=O)c2ccc(F)cc2)c1