Reaction Details
TargetMitogen-activated protein kinase 1
LigandBDBM50113677
Substrate/Competitorn/a
Meas. Tech.ChEMBL_1510717 (CHEMBL3606319)
IC50 550±n/a nM
Citation Bagdanoff, JTJain, RHan, WPoon, DLee, PSBellamacina, CLindvall, M Ligand efficient tetrahydro-pyrazolopyridines as inhibitors of ERK2 kinase. Bioorg Med Chem Lett25:3626-9 (2015) 
 
Mitogen-activated protein kinase 1
Name:Mitogen-activated protein kinase 1
Type:Ser/Thr Protein Kinase
Mol. Mass.:41392.76
Organism:Homo sapiens (Human)
Description:P28482
Residue:360
BDBM50113677
NameBDBM50113677
Synonyms:CHEMBL3604845
TypeSmall organic molecule
Emp. Form.C22H20N6O2
Mol. Mass.400.4332
SMILESO=c1nccc([nH]1)-c1n[nH]c2CCN(Cc12)c1ccn(Cc2ccccc2)c(=O)c1