Reaction Details
TargetHistone deacetylase 8
LigandBDBM50113953
Substrate/Competitorn/a
Meas. Tech.ChEMBL_1510863 (CHEMBL3606699)
IC50 8100±n/a nM
Citation Marson, CMMatthews, CJAtkinson, SJLamadema, NThomas, NS Potent and Selective Inhibitors of Histone Deacetylase-3 Containing Chiral Oxazoline Capping Groups and a N-(2-Aminophenyl)-benzamide Binding Unit. J Med Chem58:6803-18 (2015) 
 
Histone deacetylase 8
Name:Histone deacetylase 8
Type:Enzyme
Mol. Mass.:41749.60
Organism:Homo sapiens (Human)
Description:Q9BY41
Residue:377
BDBM50113953
NameBDBM50113953
Synonyms:CHEMBL3605503
TypeSmall organic molecule
Emp. Form.C23H22N4O2
Mol. Mass.386.4464
SMILESNc1ccccc1NC(=O)c1ccc(CNC2=NC[C@@H](O2)c2ccccc2)cc1