Reaction Details
TargetHistone deacetylase 1
LigandBDBM50113971
Substrate/Competitorn/a
Meas. Tech.ChEMBL_1510857 (CHEMBL3606693)
IC50 80±n/a nM
Citation Marson, CMMatthews, CJAtkinson, SJLamadema, NThomas, NS Potent and Selective Inhibitors of Histone Deacetylase-3 Containing Chiral Oxazoline Capping Groups and a N-(2-Aminophenyl)-benzamide Binding Unit. J Med Chem58:6803-18 (2015) 
 
Histone deacetylase 1
Name:Histone deacetylase 1
Type:Enzyme
Mol. Mass.:55090.27
Organism:Homo sapiens (Human)
Description:Q13547
Residue:482
BDBM50113971
NameBDBM50113971
Synonyms:CHEMBL3605506
TypeSmall organic molecule
Emp. Form.C29H26N4O2
Mol. Mass.462.5423
SMILESNc1ccccc1NC(=O)c1ccc(CNC2=N[C@@H]([C@@H](O2)c2ccccc2)c2ccccc2)cc1