Reaction Details
TargetHistone deacetylase 2
LigandBDBM50113958
Substrate/Competitorn/a
Meas. Tech.ChEMBL_1510859 (CHEMBL3606695)
IC50 130±n/a nM
Citation Marson, CMMatthews, CJAtkinson, SJLamadema, NThomas, NS Potent and Selective Inhibitors of Histone Deacetylase-3 Containing Chiral Oxazoline Capping Groups and a N-(2-Aminophenyl)-benzamide Binding Unit. J Med Chem58:6803-18 (2015) 
 
Histone deacetylase 2
Name:Histone deacetylase 2
Type:Chromatin regulator; hydrolase; repressor
Mol. Mass.:55356.54
Organism:Homo sapiens (Human)
Description:Q92769
Residue:488
BDBM50113958
NameBDBM50113958
Synonyms:CHEMBL3605501
TypeSmall organic molecule
Emp. Form.C24H24N4O2
Mol. Mass.400.473
SMILESNc1ccccc1NC(=O)c1ccc(CNC2=N[C@@H](Cc3ccccc3)CO2)cc1