Reaction Details
TargetCytochrome P450 3A5
LigandBDBM50113979
Substrate/Competitorn/a
Meas. Tech.ChEMBL_1511049 (CHEMBL3607269)
IC50>20000±n/a nM
Citation Hennessy, EJOza, VAdam, AByth, KCastriotta, LGrewal, GHamilton, GAKamhi, VMLewis, PLi, DLyne, Pึster, LRooney, MTSaeh, JCSha, LSu, QWen, SXue, YYang, B Identification and Optimization of Benzimidazole Sulfonamides as Orally Bioavailable Sphingosine 1-Phosphate Receptor 1 Antagonists with in Vivo Activity. J Med Chem58:7057-75 (2015) 
 
Cytochrome P450 3A5
Name:Cytochrome P450 3A5
Type:Protein
Mol. Mass.:57118.00
Organism:Homo sapiens (Human)
Description:P20815
Residue:502
BDBM50113979
NameBDBM50113979
Synonyms:CHEMBL3605558
TypeSmall organic molecule
Emp. Form.C19H20N6O2S
Mol. Mass.396.466
SMILESCCn1c(nc2cnc(cc12)C1CC1)[C@@H](C)NS(=O)(=O)c1ccc(nc1)C#N