Reaction Details
TargetCholinesterase
LigandBDBM50114363
Substrate/Competitorn/a
Meas. Tech.ChEMBL_1511326 (CHEMBL3606231)
IC50 7.0±n/a nM
Citation Bajda, MJonczyk, JMalawska, BCzarnecka, KGirek, MOlszewska, PSikora, JMikiciuk-Olasik, ESkibinski, RGumieniczek, ASzymanski, P Synthesis, biological evaluation and molecular modeling of new tetrahydroacridine derivatives as potential multifunctional agents for the treatment of Alzheimer's disease. Bioorg Med Chem23:5610-8 (2015) 
 
Cholinesterase
Name:Cholinesterase
Type:Enzyme
Mol. Mass.:65643.35
Organism:Equus caballus (Horse)
Description:P81908
Residue:574
BDBM50114363
NameBDBM50114363
Synonyms:CHEMBL3604194
TypeSmall organic molecule
Emp. Form.C26H33ClN4O
Mol. Mass.453.019
SMILESCl.CN(C)c1ccc(cc1)C(=O)NCCCCNc1c2CCCCc2nc2ccccc12