Reaction Details
TargetAcetylcholinesterase
LigandBDBM50114366
Substrate/Competitorn/a
Meas. Tech.ChEMBL_1511335 (CHEMBL3606356)
IC50 75±n/a nM
Citation Bajda, MJonczyk, JMalawska, BCzarnecka, KGirek, MOlszewska, PSikora, JMikiciuk-Olasik, ESkibinski, RGumieniczek, ASzymanski, P Synthesis, biological evaluation and molecular modeling of new tetrahydroacridine derivatives as potential multifunctional agents for the treatment of Alzheimer's disease. Bioorg Med Chem23:5610-8 (2015) 
 
Acetylcholinesterase
Name:Acetylcholinesterase
Type:Enzyme
Mol. Mass.:67792.70
Organism:Homo sapiens (Human)
Description:P22303
Residue:614
BDBM50114366
NameBDBM50114366
Synonyms:CHEMBL3604197
TypeSmall organic molecule
Emp. Form.C29H39ClN4O
Mol. Mass.495.099
SMILESCl.CN(C)c1ccc(cc1)C(=O)NCCCCCCCNc1c2CCCCc2nc2ccccc12