Reaction Details
TargetAcetylcholinesterase
LigandBDBM50114368
Substrate/Competitorn/a
Meas. Tech.ChEMBL_1511335 (CHEMBL3606356)
IC50 125±n/a nM
Citation Bajda, MJonczyk, JMalawska, BCzarnecka, KGirek, MOlszewska, PSikora, JMikiciuk-Olasik, ESkibinski, RGumieniczek, ASzymanski, P Synthesis, biological evaluation and molecular modeling of new tetrahydroacridine derivatives as potential multifunctional agents for the treatment of Alzheimer's disease. Bioorg Med Chem23:5610-8 (2015) 
 
Acetylcholinesterase
Name:Acetylcholinesterase
Type:Enzyme
Mol. Mass.:67792.70
Organism:Homo sapiens (Human)
Description:P22303
Residue:614
BDBM50114368
NameBDBM50114368
Synonyms:CHEMBL3604199
TypeSmall organic molecule
Emp. Form.C31H43ClN4O
Mol. Mass.523.152
SMILESCl.CN(C)c1ccc(cc1)C(=O)NCCCCCCCCCNc1c2CCCCc2nc2ccccc12