Reaction Details
TargetMu-type opioid receptor
LigandBDBM50114371
Substrate/Competitorn/a
Meas. Tech.ChEMBL_1511477 (CHEMBL3606826)
Ki 2267±n/a nM
Citation Loriga, GLazzari, PManca, IRuiu, SFalzoi, MMurineddu, GBottazzi, MEPinna, GPinna, GA Novel diazabicycloalkane delta opioid agonists. Bioorg Med Chem23:5527-38 (2015) 
 
Mu-type opioid receptor
Name:Mu-type opioid receptor
Type:Enzyme Catalytic Domain
Mol. Mass.:44431.62
Organism:MOUSE
Description:OPIATE Mu OPRM1 MOUSE::P42866
Residue:398
BDBM50114371
NameBDBM50114371
Synonyms:CHEMBL3604280
TypeSmall organic molecule
Emp. Form.C29H39N3O2
Mol. Mass.461.6389
SMILESCCN(CC)C(=O)c1ccc(cc1)C(N1C2CCCC1CN(CC=C)C2)c1cccc(OC)c1