Reaction Details
TargetDelta-type opioid receptor
LigandBDBM50114373
Substrate/Competitorn/a
Meas. Tech.ChEMBL_1511478 (CHEMBL3606827)
Ki 1.8±n/a nM
Citation Loriga, GLazzari, PManca, IRuiu, SFalzoi, MMurineddu, GBottazzi, MEPinna, GPinna, GA Novel diazabicycloalkane delta opioid agonists. Bioorg Med Chem23:5527-38 (2015) 
 
Delta-type opioid receptor
Name:Delta-type opioid receptor
Type:Enzyme Catalytic Domain
Mol. Mass.:40577.25
Organism:MOUSE
Description:P32300
Residue:372
BDBM50114373
NameBDBM50114373
Synonyms:CHEMBL3604278
TypeSmall organic molecule
Emp. Form.C27H35N3O2
Mol. Mass.433.5857
SMILESCCN(CC)C(=O)c1ccc(cc1)C(N1C2CC1CN(CC=C)C2)c1cccc(OC)c1