Reaction Details
TargetMacrophage-stimulating protein receptor
LigandBDBM50114396
Substrate/Competitorn/a
Meas. Tech.ChEMBL_1513320 (CHEMBL3611224)
IC50 34±n/a nM
Citation Raeppel, SLTherrien, ERaeppel, F Design and synthesis of constrained analogs of LCRF-0004 as potent RON tyrosine kinase inhibitors. Bioorg Med Chem Lett25:3706-10 (2015) 
 
Macrophage-stimulating protein receptor
Name:Macrophage-stimulating protein receptor
Type:Protein
Mol. Mass.:152270.76
Organism:Homo sapiens (Human)
Description:Q04912
Residue:1400
BDBM50114396
NameBDBM50114396
Synonyms:CHEMBL3609807
TypeSmall organic molecule
Emp. Form.C30H23FN6O2S
Mol. Mass.550.606
SMILESCn1cnc(c1)-c1cc2nccc(Oc3ccc(cc3F)N3CCCc4c(cnn4-c4ccccc4)C3=O)c2s1