Reaction Details
TargetL-lactate dehydrogenase A chain
LigandBDBM50114400
Substrate/Competitorn/a
Meas. Tech.ChEMBL_1513323 (CHEMBL3611227)
IC50 100000±n/a nM
Citation Rupiani, SBuonfiglio, RManerba, MDi Ianni, LVettraino, MGiacomini, EMasetti, MFalchi, FDi Stefano, GRoberti, MRecanatini, M Identification of N-acylhydrazone derivatives as novel lactate dehydrogenase A inhibitors. Eur J Med Chem101:63-70 (2015) 
 
L-lactate dehydrogenase A chain
Name:L-lactate dehydrogenase A chain
Type:Protein
Mol. Mass.:36694.85
Organism:Homo sapiens (Human)
Description:P00338::PDB Code: 4ajp
Residue:332
BDBM50114400
NameBDBM50114400
Synonyms:CHEMBL3608329
TypeSmall organic molecule
Emp. Form.C21H15N3O4
Mol. Mass.373.3615
SMILESOC(=O)c1cccc(c1)-c1ccc(\C=N\NC(=O)c2ccc3[nH]ccc3c2)o1