Reaction Details
TargetL-lactate dehydrogenase A chain
LigandBDBM50114410
Substrate/Competitorn/a
Meas. Tech.ChEMBL_1513322 (CHEMBL3611226)
IC50>200000±n/a nM
Citation Rupiani, SBuonfiglio, RManerba, MDi Ianni, LVettraino, MGiacomini, EMasetti, MFalchi, FDi Stefano, GRoberti, MRecanatini, M Identification of N-acylhydrazone derivatives as novel lactate dehydrogenase A inhibitors. Eur J Med Chem101:63-70 (2015) 
 
L-lactate dehydrogenase A chain
Name:L-lactate dehydrogenase A chain
Type:Protein
Mol. Mass.:36694.85
Organism:Homo sapiens (Human)
Description:P00338::PDB Code: 4ajp
Residue:332
BDBM50114410
NameBDBM50114410
Synonyms:CHEMBL3608332
TypeSmall organic molecule
Emp. Form.C19H15N3O4
Mol. Mass.349.3401
SMILESCOC(=O)c1cccc(c1)-c1ccc(\C=N\NC(=O)c2cccnc2)o1