Reaction Details
TargetL-lactate dehydrogenase A chain
LigandBDBM50114405
Substrate/Competitorn/a
Meas. Tech.ChEMBL_1513322 (CHEMBL3611226)
IC50 125000±n/a nM
Citation Rupiani, SBuonfiglio, RManerba, MDi Ianni, LVettraino, MGiacomini, EMasetti, MFalchi, FDi Stefano, GRoberti, MRecanatini, M Identification of N-acylhydrazone derivatives as novel lactate dehydrogenase A inhibitors. Eur J Med Chem101:63-70 (2015) 
 
L-lactate dehydrogenase A chain
Name:L-lactate dehydrogenase A chain
Type:Protein
Mol. Mass.:36694.85
Organism:Homo sapiens (Human)
Description:P00338::PDB Code: 4ajp
Residue:332
BDBM50114405
NameBDBM50114405
Synonyms:CHEMBL3609813
TypeSmall organic molecule
Emp. Form.C22H20N2O7
Mol. Mass.424.4034
SMILESCOc1cc(cc(OC)c1OC)C(=O)N\N=C\c1ccc(o1)-c1ccc(cc1)C(O)=O