Reaction Details
TargetProstaglandin G/H synthase 2
LigandBDBM17638
Substrate/Competitorn/a
Meas. Tech.ChEMBL_1513799 (CHEMBL3611117)
IC50 3930±n/a nM
Citation Banerjee, AGDas, NShengule, SASrivastava, RSShrivastava, SK Synthesis, characterization, evaluation and molecular dynamics studies of 5, 6-diphenyl-1,2,4-triazin-3(2H)-one derivatives bearing 5-substituted 1,3,4-oxadiazole as potential anti-inflammatory and analgesic agents. Eur J Med Chem101:81-95 (2015) 
 
Prostaglandin G/H synthase 2
Name:Prostaglandin G/H synthase 2
Type:Protein
Mol. Mass.:68976.98
Organism:Ovis aries (Sheep)
Description:n/a
Residue:603
BDBM17638
NameBDBM17638
Synonyms:2-{1-[(4-chlorophenyl)carbonyl]-5-methoxy-2-methyl-1H-indol-3-yl}acetic acid Indocin US11478464, Compound Indomethacin US9271961, Indomethacin | indometacin
TypeSmall organic molecule
Emp. Form.C19H16ClNO4
Mol. Mass.357.788
SMILESCOc1ccc2n(C(=O)c3ccc(Cl)cc3)c(C)c(CC(O)=O)c2c1