Reaction Details
TargetPotassium voltage-gated channel subfamily H member 2
LigandBDBM50114805
Substrate/Competitorn/a
Meas. Tech.ChEMBL_1512331 (CHEMBL3611882)
Ki 3600±n/a nM
Citation Methot, JLFischer, CLi, CRivkin, AAhearn, SPBrown, WCKattar, SKelley, EMampreian, DMSchell, ARosenau, AZhou, HBall, RDeshmukh, SVJeliazkova-Mecheva, VVDiaz, DMoy, LYKenific, CMMoxham, CShah, SNuthall, HSzewczak, AAHill, AHughes, BSmotrov, NMunoz, BMiller, TAShearman, MS Potent benzoazepinoneż-secretase modulators with improved bioavailability. Bioorg Med Chem Lett25:3495-500 (2015) 
 
Potassium voltage-gated channel subfamily H member 2
Name:Potassium voltage-gated channel subfamily H member 2
Type:Multi-pass membrane protein
Mol. Mass.:126672.65
Organism:Homo sapiens (Human)
Description:Q12809
Residue:1159
BDBM50114805
NameBDBM50114805
Synonyms:CHEMBL3608384
TypeSmall organic molecule
Emp. Form.C24H20F4N6O
Mol. Mass.484.4488
SMILESCc1cn(cn1)-c1ccc(cc1)-c1cn(nn1)[C@H]1CCc2c(F)cccc2N(CC(F)(F)F)C1=O