Reaction Details
TargetPotassium voltage-gated channel subfamily H member 2
LigandBDBM50114806
Substrate/Competitorn/a
Meas. Tech.ChEMBL_1512331 (CHEMBL3611882)
Ki 1900±n/a nM
Citation Methot, JLFischer, CLi, CRivkin, AAhearn, SPBrown, WCKattar, SKelley, EMampreian, DMSchell, ARosenau, AZhou, HBall, RDeshmukh, SVJeliazkova-Mecheva, VVDiaz, DMoy, LYKenific, CMMoxham, CShah, SNuthall, HSzewczak, AAHill, AHughes, BSmotrov, NMunoz, BMiller, TAShearman, MS Potent benzoazepinoneż-secretase modulators with improved bioavailability. Bioorg Med Chem Lett25:3495-500 (2015) 
 
Potassium voltage-gated channel subfamily H member 2
Name:Potassium voltage-gated channel subfamily H member 2
Type:Multi-pass membrane protein
Mol. Mass.:126672.65
Organism:Homo sapiens (Human)
Description:Q12809
Residue:1159
BDBM50114806
NameBDBM50114806
Synonyms:CHEMBL3609752
TypeSmall organic molecule
Emp. Form.C25H22F4N6O2
Mol. Mass.514.4748
SMILESCOc1cc(ccc1-c1cn(nn1)[C@H]1CCc2c(F)cccc2N(CC(F)(F)F)C1=O)-n1cnc(C)c1