Reaction Details
TargetCarbonic anhydrase 7
LigandBDBM50386717
Substrate/Competitorn/a
Meas. Tech.ChEMBL_1512522 (CHEMBL3610386)
Ki 4.6±n/a nM
Citation Krasavin, MKorsakov, MDorogov, MTuccinardi, TDedeoglu, NSupuran, CT Probing the 'bipolar' nature of the carbonic anhydrase active site: aromatic sulfonamides containing 1,3-oxazol-5-yl moiety as picomolar inhibitors of cytosolic CA I and CA II isoforms. Eur J Med Chem101:334-47 (2015) 
 
Carbonic anhydrase 7
Name:Carbonic anhydrase 7
Type:Enzyme
Mol. Mass.:29664.11
Organism:Homo sapiens (Human)
Description:Human cloned isozyme.
Residue:264
BDBM50386717
NameBDBM50386717
Synonyms:CHEMBL2048919
TypeSmall organic molecule
Emp. Form.C17H20N2O4S
Mol. Mass.348.417
SMILESCOc1cc2CCNC(c3ccc(cc3)S(N)(=O)=O)c2cc1OC