Reaction Details
TargetCarbonic anhydrase 12
LigandBDBM50114861
Substrate/Competitorn/a
Meas. Tech.ChEMBL_1512516 (CHEMBL3610380)
Ki 42±n/a nM
Citation Krasavin, MKorsakov, MDorogov, MTuccinardi, TDedeoglu, NSupuran, CT Probing the 'bipolar' nature of the carbonic anhydrase active site: aromatic sulfonamides containing 1,3-oxazol-5-yl moiety as picomolar inhibitors of cytosolic CA I and CA II isoforms. Eur J Med Chem101:334-47 (2015) 
 
Carbonic anhydrase 12
Name:Carbonic anhydrase 12
Type:Enzyme
Mol. Mass.:39456.00
Organism:Homo sapiens (Human)
Description:Catalytic domain of human cloned isozyme was used in the assay
Residue:354
BDBM50114861
NameBDBM50114861
Synonyms:CHEMBL3608873
TypeSmall organic molecule
Emp. Form.C14H15N3O4S
Mol. Mass.321.352
SMILESNS(=O)(=O)c1ccc(cc1)-c1cnc(o1)C(=O)N1CCCC1