Reaction Details
TargetCarbonic anhydrase 12
LigandBDBM50114868
Substrate/Competitorn/a
Meas. Tech.ChEMBL_1512516 (CHEMBL3610380)
Ki 63±n/a nM
Citation Krasavin, MKorsakov, MDorogov, MTuccinardi, TDedeoglu, NSupuran, CT Probing the 'bipolar' nature of the carbonic anhydrase active site: aromatic sulfonamides containing 1,3-oxazol-5-yl moiety as picomolar inhibitors of cytosolic CA I and CA II isoforms. Eur J Med Chem101:334-47 (2015) 
 
Carbonic anhydrase 12
Name:Carbonic anhydrase 12
Type:Enzyme
Mol. Mass.:39456.00
Organism:Homo sapiens (Human)
Description:Catalytic domain of human cloned isozyme was used in the assay
Residue:354
BDBM50114868
NameBDBM50114868
Synonyms:CHEMBL3608880
TypeSmall organic molecule
Emp. Form.C14H16N2O4S
Mol. Mass.308.353
SMILESCOc1ccc(cc1S(N)(=O)=O)-c1cnc(o1)C1CCC1