Reaction Details
TargetCarbonic anhydrase 1
LigandBDBM50114852
Substrate/Competitorn/a
Meas. Tech.ChEMBL_1512513 (CHEMBL3610377)
Ki 23±n/a nM
Citation Krasavin, MKorsakov, MDorogov, MTuccinardi, TDedeoglu, NSupuran, CT Probing the 'bipolar' nature of the carbonic anhydrase active site: aromatic sulfonamides containing 1,3-oxazol-5-yl moiety as picomolar inhibitors of cytosolic CA I and CA II isoforms. Eur J Med Chem101:334-47 (2015) 
 
Carbonic anhydrase 1
Name:Carbonic anhydrase 1
Type:Enzyme
Mol. Mass.:28873.37
Organism:Homo sapiens (Human)
Description:P00915
Residue:261
BDBM50114852
NameBDBM50114852
Synonyms:CHEMBL3608889
TypeSmall organic molecule
Emp. Form.C12H13N3O5S2
Mol. Mass.343.379
SMILESNS(=O)(=O)c1ccc(s1)-c1cnc(o1)C(=O)N1CCOCC1