Reaction Details
TargetCarbonic anhydrase 1
LigandBDBM50114853
Substrate/Competitorn/a
Meas. Tech.ChEMBL_1512513 (CHEMBL3610377)
Ki 0.050000±n/a nM
Citation Krasavin, MKorsakov, MDorogov, MTuccinardi, TDedeoglu, NSupuran, CT Probing the 'bipolar' nature of the carbonic anhydrase active site: aromatic sulfonamides containing 1,3-oxazol-5-yl moiety as picomolar inhibitors of cytosolic CA I and CA II isoforms. Eur J Med Chem101:334-47 (2015) 
 
Carbonic anhydrase 1
Name:Carbonic anhydrase 1
Type:Enzyme
Mol. Mass.:28873.37
Organism:Homo sapiens (Human)
Description:P00915
Residue:261
BDBM50114853
NameBDBM50114853
Synonyms:CHEMBL3608890
TypeSmall organic molecule
Emp. Form.C8H8N2O3S2
Mol. Mass.244.291
SMILESCc1ncc(o1)-c1csc(c1)S(N)(=O)=O