Reaction Details
TargetCarbonic anhydrase 2
LigandBDBM50114859
Substrate/Competitorn/a
Meas. Tech.ChEMBL_1512514 (CHEMBL3610378)
Ki 0.010000±n/a nM
Citation Krasavin, MKorsakov, MDorogov, MTuccinardi, TDedeoglu, NSupuran, CT Probing the 'bipolar' nature of the carbonic anhydrase active site: aromatic sulfonamides containing 1,3-oxazol-5-yl moiety as picomolar inhibitors of cytosolic CA I and CA II isoforms. Eur J Med Chem101:334-47 (2015) 
 
Carbonic anhydrase 2
Name:Carbonic anhydrase 2
Type:Enzyme
Mol. Mass.:29250.71
Organism:Homo sapiens (Human)
Description:P00918
Residue:260
BDBM50114859
NameBDBM50114859
Synonyms:CHEMBL3608871
TypeSmall organic molecule
Emp. Form.C12H12N2O3S
Mol. Mass.264.3
SMILESNS(=O)(=O)c1ccc(cc1)-c1cnc(o1)C1CC1