Reaction Details
Target5-hydroxytryptamine receptor 2B
LigandBDBM50114874
Substrate/Competitorn/a
Meas. Tech.ChEMBL_1512579 (CHEMBL3610528)
Ki 299±n/a nM
Citation Kapadia, NHarding, WW C4 phenyl aporphines with selective h5-HT(2B) receptor affinity. Bioorg Med Chem Lett25:3451-4 (2015) 
 
5-hydroxytryptamine receptor 2B
Name:5-hydroxytryptamine receptor 2B
Type:G Protein-Coupled Receptor (GPCR)
Mol. Mass.:54312.47
Organism:Homo sapiens (Human)
Description:Receptor binding assays were performed using human clone stably expressed in CHO cells.
Residue:481
BDBM50114874
NameBDBM50114874
Synonyms:CHEMBL3609143
TypeSmall organic molecule
Emp. Form.C29H29NO4
Mol. Mass.455.5449
SMILESCOc1cc2C(CN(C)C3Cc4cc5OCOc5cc4-c(c1OCC1CC1)c23)c1ccccc1