Reaction Details
TargetPancreatic triacylglycerol lipase
LigandBDBM24567
Substrate/Competitorn/a
Meas. Tech.ChEMBL_1512589 (CHEMBL3610636)
IC50 320±n/a nM
Citation Jo, YHKim, SBLiu, QLee, JWHwang, BYLee, MK Benzylated and prenylated flavonoids from the root barks of Cudrania tricuspidata with pancreatic lipase inhibitory activity. Bioorg Med Chem Lett25:3455-7 (2015) 
 
Pancreatic triacylglycerol lipase
Name:Pancreatic triacylglycerol lipase
Type:Enzyme
Mol. Mass.:50080.69
Organism:Sus scrofa (Pig)
Description:P00591
Residue:450
BDBM24567
NameBDBM24567
Synonyms:(2S)-1-[(2S,3S)-3-hexyl-4-oxooxetan-2-yl]tridecan-2-yl (2S)-2-formamido-4-methylpentanoate Orlistat Tetrahydrolipstatin Xenical
TypeSmall organic molecule
Emp. Form.C29H53NO5
Mol. Mass.495.7348
SMILESCCCCCCCCCCC[C@@H](C[C@@H]1OC(=O)[C@H]1CCCCCC)OC(=O)[C@H](CC(C)C)NC=O