Reaction Details
TargetD(1A) dopamine receptor
LigandBDBM82247
Substrate/Competitorn/a
Meas. Tech.ChEMBL_1512602 (CHEMBL3610649)
Ki 1.7±n/a nM
Citation Deng, XGuo, LXu, LZhen, XYu, KZhao, WFu, W Discovery of novel potent and selective ligands for 5-HT2A receptor with quinazoline scaffold. Bioorg Med Chem Lett25:3970-4 (2015) 
 
D(1A) dopamine receptor
Name:D(1A) dopamine receptor
Type:Enzyme
Mol. Mass.:49303.43
Organism:Homo sapiens (Human)
Description:P21728
Residue:446
BDBM82247
NameBDBM82247
Synonyms:8-Chloro-3-methyl-5-phenyl-2,3,4,5-tetrahydro-1H-benzo[d]azepin-7-ol(SCH 23390) CHEMBL2158641 SCH 23388 SCH 23390 (R-enantiomer) | SCH 23390,R(+)
TypeSmall organic molecule
Emp. Form.C17H18ClNO
Mol. Mass.287.784
SMILESCN1CCc2cc(Cl)c(O)cc2[C@H](C1)c1ccccc1