Reaction Details
Target5-hydroxytryptamine receptor 2A
LigandBDBM50366495
Substrate/Competitorn/a
Meas. Tech.ChEMBL_1512597 (CHEMBL3610644)
Ki 3.0±n/a nM
Citation Deng, XGuo, LXu, LZhen, XYu, KZhao, WFu, W Discovery of novel potent and selective ligands for 5-HT2A receptor with quinazoline scaffold. Bioorg Med Chem Lett25:3970-4 (2015) 
 
5-hydroxytryptamine receptor 2A
Name:5-hydroxytryptamine receptor 2A
Type:undefined
Mol. Mass.:52607.65
Organism:Homo sapiens (Human)
Description:P28223
Residue:471
BDBM50366495
NameBDBM50366495
Synonyms:(+)butaclamol | CHEMBL1255588
TypeSmall organic molecule
Emp. Form.C25H31NO
Mol. Mass.361.5197
SMILESCC(C)(C)[C@@]1(O)CCN2C[C@@H]3c4ccccc4CCc4cccc([C@H]2C1)c34