Reaction Details
TargetMacrophage-stimulating protein receptor
LigandBDBM50115202
Substrate/Competitorn/a
Meas. Tech.ChEMBL_1513738 (CHEMBL3610848)
IC50 27±n/a nM
Citation Raeppel, FRaeppel, SLTherrien, E Design, synthesis and RON receptor tyrosine kinase inhibitory activity of new head groups analogs of LCRF-0004. Bioorg Med Chem Lett25:3810-5 (2015) 
 
Macrophage-stimulating protein receptor
Name:Macrophage-stimulating protein receptor
Type:Protein
Mol. Mass.:152270.76
Organism:Homo sapiens (Human)
Description:Q04912
Residue:1400
BDBM50115202
NameBDBM50115202
Synonyms:CHEMBL3608550
TypeSmall organic molecule
Emp. Form.C34H25FN6O3S
Mol. Mass.616.664
SMILESCOc1cccc(c1)-c1c(cnn1-c1ccccc1)C(=O)Nc1ccc(Oc2ccnc3cc(sc23)-c2cn(C)cn2)c(F)c1