Reaction Details
TargetC-X-C chemokine receptor type 2
LigandBDBM50115211
Substrate/Competitorn/a
Meas. Tech.ChEMBL_1513746 (CHEMBL3610856)
IC50 2600±n/a nM
Citation Schuler, ADEngles, CAMaeda, DYQuinn, MTKirpotina, LNWicomb, WNMason, SNAuten, RLZebala, JA Boronic acid-containing aminopyridine- and aminopyrimidinecarboxamide CXCR1/2 antagonists: Optimization of aqueous solubility and oral bioavailability. Bioorg Med Chem Lett25:3793-7 (2015) 
 
C-X-C chemokine receptor type 2
Name:C-X-C chemokine receptor type 2
Type:Protein
Mol. Mass.:40767.88
Organism:Homo sapiens (Human)
Description:P25025
Residue:360
BDBM50115211
NameBDBM50115211
Synonyms:CHEMBL3609010
TypeSmall organic molecule
Emp. Form.C18H16BFN4O3
Mol. Mass.366.154
SMILESOB(O)c1ccc(CNc2ncc(cn2)C(=O)Nc2ccc(F)cc2)cc1