Reaction Details
TargetC-X-C chemokine receptor type 2
LigandBDBM50115212
Substrate/Competitorn/a
Meas. Tech.ChEMBL_1513746 (CHEMBL3610856)
IC50 2500±n/a nM
Citation Schuler, ADEngles, CAMaeda, DYQuinn, MTKirpotina, LNWicomb, WNMason, SNAuten, RLZebala, JA Boronic acid-containing aminopyridine- and aminopyrimidinecarboxamide CXCR1/2 antagonists: Optimization of aqueous solubility and oral bioavailability. Bioorg Med Chem Lett25:3793-7 (2015) 
 
C-X-C chemokine receptor type 2
Name:C-X-C chemokine receptor type 2
Type:Protein
Mol. Mass.:40767.88
Organism:Homo sapiens (Human)
Description:P25025
Residue:360
BDBM50115212
NameBDBM50115212
Synonyms:CHEMBL3609009
TypeSmall organic molecule
Emp. Form.C19H18BFN4O3
Mol. Mass.380.181
SMILESCN(Cc1cccc(c1)B(O)O)c1ncc(cn1)C(=O)Nc1ccc(F)cc1