Reaction Details
TargetC-X-C chemokine receptor type 1
LigandBDBM150812
Substrate/Competitorn/a
Meas. Tech.ChEMBL_1513745 (CHEMBL3610855)
IC50 31±n/a nM
Citation Schuler, ADEngles, CAMaeda, DYQuinn, MTKirpotina, LNWicomb, WNMason, SNAuten, RLZebala, JA Boronic acid-containing aminopyridine- and aminopyrimidinecarboxamide CXCR1/2 antagonists: Optimization of aqueous solubility and oral bioavailability. Bioorg Med Chem Lett25:3793-7 (2015) 
 
C-X-C chemokine receptor type 1
Name:C-X-C chemokine receptor type 1
Type:Enzyme
Mol. Mass.:39803.83
Organism:Homo sapiens (Human)
Description:P25024
Residue:350
BDBM150812
NameBDBM150812
Synonyms:US8981106, 2 (SX-576) | USRE47267, Compound 2
TypeSmall organic molecule
Emp. Form.C20H15BF4N2O4S
Mol. Mass.466.214
SMILESOB(O)c1ccc(OC(F)(F)F)cc1CSc1ccc(cn1)C(=O)Nc1ccc(F)cc1