Reaction Details
TargetC-X-C chemokine receptor type 1
LigandBDBM50115219
Substrate/Competitorn/a
Meas. Tech.ChEMBL_1513745 (CHEMBL3610855)
IC50 4100±n/a nM
Citation Schuler, ADEngles, CAMaeda, DYQuinn, MTKirpotina, LNWicomb, WNMason, SNAuten, RLZebala, JA Boronic acid-containing aminopyridine- and aminopyrimidinecarboxamide CXCR1/2 antagonists: Optimization of aqueous solubility and oral bioavailability. Bioorg Med Chem Lett25:3793-7 (2015) 
 
C-X-C chemokine receptor type 1
Name:C-X-C chemokine receptor type 1
Type:Enzyme
Mol. Mass.:39803.83
Organism:Homo sapiens (Human)
Description:P25024
Residue:350
BDBM50115219
NameBDBM50115219
Synonyms:CHEMBL3609003
TypeSmall organic molecule
Emp. Form.C20H19BFN3O3
Mol. Mass.379.193
SMILESCN(Cc1cccc(c1)B(O)O)c1ccc(cn1)C(=O)Nc1ccc(F)cc1