Reaction Details
TargetC-X-C chemokine receptor type 1
LigandBDBM50115286
Substrate/Competitorn/a
Meas. Tech.ChEMBL_1513745 (CHEMBL3610855)
IC50 3.3±n/a nM
Citation Schuler, ADEngles, CAMaeda, DYQuinn, MTKirpotina, LNWicomb, WNMason, SNAuten, RLZebala, JA Boronic acid-containing aminopyridine- and aminopyrimidinecarboxamide CXCR1/2 antagonists: Optimization of aqueous solubility and oral bioavailability. Bioorg Med Chem Lett25:3793-7 (2015) 
 
C-X-C chemokine receptor type 1
Name:C-X-C chemokine receptor type 1
Type:Enzyme
Mol. Mass.:39803.83
Organism:Homo sapiens (Human)
Description:P25024
Residue:350
BDBM50115286
NameBDBM50115286
Synonyms:CHEMBL3609016
TypeSmall organic molecule
Emp. Form.C23H20BFN4O4
Mol. Mass.446.239
SMILESOB(O)c1ccc(CN(Cc2ccco2)c2ccc(cn2)C(=O)Nc2ccc(F)cc2)nc1