Reaction Details
TargetC-X-C chemokine receptor type 2
LigandBDBM50115286
Substrate/Competitorn/a
Meas. Tech.ChEMBL_1513746 (CHEMBL3610856)
IC50 21±n/a nM
Citation Schuler, ADEngles, CAMaeda, DYQuinn, MTKirpotina, LNWicomb, WNMason, SNAuten, RLZebala, JA Boronic acid-containing aminopyridine- and aminopyrimidinecarboxamide CXCR1/2 antagonists: Optimization of aqueous solubility and oral bioavailability. Bioorg Med Chem Lett25:3793-7 (2015) 
 
C-X-C chemokine receptor type 2
Name:C-X-C chemokine receptor type 2
Type:Protein
Mol. Mass.:40767.88
Organism:Homo sapiens (Human)
Description:P25025
Residue:360
BDBM50115286
NameBDBM50115286
Synonyms:CHEMBL3609016
TypeSmall organic molecule
Emp. Form.C23H20BFN4O4
Mol. Mass.446.239
SMILESOB(O)c1ccc(CN(Cc2ccco2)c2ccc(cn2)C(=O)Nc2ccc(F)cc2)nc1