Reaction Details
TargetMitogen-activated protein kinase 1
LigandBDBM50115395
Substrate/Competitorn/a
Meas. Tech.ChEMBL_1513909 (CHEMBL3611591)
IC50 2.3±n/a nM
Citation Bagdanoff, JTJain, RHan, WZhu, SMadiera, AMLee, PSMa, XPoon, D Tetrahydropyrrolo-diazepenones as inhibitors of ERK2 kinase. Bioorg Med Chem Lett25:3788-92 (2015) 
 
Mitogen-activated protein kinase 1
Name:Mitogen-activated protein kinase 1
Type:Ser/Thr Protein Kinase
Mol. Mass.:41392.76
Organism:Homo sapiens (Human)
Description:P28482
Residue:360
BDBM50115395
NameBDBM50115395
Synonyms:CHEMBL3608460
TypeSmall organic molecule
Emp. Form.C25H29N5O3
Mol. Mass.447.5295
SMILESOC[C@@H](N1CCCn2cc(cc2C1=O)-c1ccnc(N[C@H]2CC[C@@H](O)C2)n1)c1ccccc1