Reaction Details
TargetMitogen-activated protein kinase 1
LigandBDBM50115403
Substrate/Competitorn/a
Meas. Tech.ChEMBL_1513909 (CHEMBL3611591)
IC50 0.160000±n/a nM
Citation Bagdanoff, JTJain, RHan, WZhu, SMadiera, AMLee, PSMa, XPoon, D Tetrahydropyrrolo-diazepenones as inhibitors of ERK2 kinase. Bioorg Med Chem Lett25:3788-92 (2015) 
 
Mitogen-activated protein kinase 1
Name:Mitogen-activated protein kinase 1
Type:Ser/Thr Protein Kinase
Mol. Mass.:41392.76
Organism:Homo sapiens (Human)
Description:P28482
Residue:360
BDBM50115403
NameBDBM50115403
Synonyms:CHEMBL3608591
TypeSmall organic molecule
Emp. Form.C24H26ClN5O3
Mol. Mass.467.948
SMILESOC[C@@H](N1CCn2cc(cc2C1=O)-c1ccnc(NC2CCOCC2)n1)c1cccc(Cl)c1