Reaction Details
TargetMitogen-activated protein kinase 1
LigandBDBM50115393
Substrate/Competitorn/a
Meas. Tech.ChEMBL_1513912 (CHEMBL3611594)
IC50 69±n/a nM
Citation Bagdanoff, JTJain, RHan, WZhu, SMadiera, AMLee, PSMa, XPoon, D Tetrahydropyrrolo-diazepenones as inhibitors of ERK2 kinase. Bioorg Med Chem Lett25:3788-92 (2015) 
 
Mitogen-activated protein kinase 1
Name:Mitogen-activated protein kinase 1
Type:Ser/Thr Protein Kinase
Mol. Mass.:41392.76
Organism:Homo sapiens (Human)
Description:P28482
Residue:360
BDBM50115393
NameBDBM50115393
Synonyms:CHEMBL3608458
TypeSmall organic molecule
Emp. Form.C25H28FN5O3
Mol. Mass.465.5199
SMILESOC[C@@H](N1CCCn2cc(cc2C1=O)-c1ccnc(N[C@@H]2C[C@H](O)[C@@H](F)C2)n1)c1ccccc1