Reaction Details
TargetMitogen-activated protein kinase 1
LigandBDBM50115405
Substrate/Competitorn/a
Meas. Tech.ChEMBL_1513909 (CHEMBL3611591)
IC50 0.260000±n/a nM
Citation Bagdanoff, JTJain, RHan, WZhu, SMadiera, AMLee, PSMa, XPoon, D Tetrahydropyrrolo-diazepenones as inhibitors of ERK2 kinase. Bioorg Med Chem Lett25:3788-92 (2015) 
 
Mitogen-activated protein kinase 1
Name:Mitogen-activated protein kinase 1
Type:Ser/Thr Protein Kinase
Mol. Mass.:41392.76
Organism:Homo sapiens (Human)
Description:P28482
Residue:360
BDBM50115405
NameBDBM50115405
Synonyms:CHEMBL3608459
TypeSmall organic molecule
Emp. Form.C25H26ClF2N5O3
Mol. Mass.517.955
SMILESOC[C@@H](N1CCCn2cc(cc2C1=O)-c1ccnc(N[C@@H]2C[C@H](O)C(F)(F)C2)n1)c1cccc(Cl)c1