Reaction Details
TargetATP-dependent translocase ABCB1
LigandBDBM50115960
Substrate/Competitorn/a
Meas. Tech.ChEMBL_1514812 (CHEMBL3615230)
Ki 1010±n/a nM
Citation Wang, FLiu, ZWang, JTao, JGong, PBao, XZhao, YWang, Y The interaction of 4-thiazolidinone derivatives containing indolin-2-one moiety with P-glycoprotein studied using K562 cell lines. Eur J Med Chem101:126-32 (2015) 
 
ATP-dependent translocase ABCB1
Name:ATP-dependent translocase ABCB1
Type:Protein
Mol. Mass.:141503.50
Organism:Homo sapiens (Human)
Description:P08183
Residue:1280
BDBM50115960
NameBDBM50115960
Synonyms:CHEMBL3612148
TypeSmall organic molecule
Emp. Form.C25H24F3N3O2S
Mol. Mass.487.537
SMILESCCN(CC)CCCn1c(=O)\c(=C\c2ccc(F)cc2F)s\c1=C1\C(=O)Nc2cc(F)ccc12