Reaction Details
TargetATP-dependent translocase ABCB1
LigandBDBM50115985
Substrate/Competitorn/a
Meas. Tech.ChEMBL_1514812 (CHEMBL3615230)
Ki>2230±n/a nM
Citation Wang, FLiu, ZWang, JTao, JGong, PBao, XZhao, YWang, Y The interaction of 4-thiazolidinone derivatives containing indolin-2-one moiety with P-glycoprotein studied using K562 cell lines. Eur J Med Chem101:126-32 (2015) 
 
ATP-dependent translocase ABCB1
Name:ATP-dependent translocase ABCB1
Type:Protein
Mol. Mass.:141503.50
Organism:Homo sapiens (Human)
Description:P08183
Residue:1280
BDBM50115985
NameBDBM50115985
Synonyms:CHEMBL3612157
TypeSmall organic molecule
Emp. Form.C25H26ClN3O3S
Mol. Mass.484.01
SMILESCCN(CC)CCCn1c(=O)\c(=C\c2ccc(O)cc2)s\c1=C1\C(=O)Nc2ccc(Cl)cc12