Reaction Details
TargetNeuronal acetylcholine receptor subunit alpha-4/beta-2
LigandBDBM50116299
Substrate/Competitorn/a
Meas. Tech.ChEMBL_1514960 (CHEMBL3615826)
IC50 100±n/a nM
Citation Matera, CPucci, LFiorentini, CFucile, SMissale, CGrazioso, GClementi, FZoli, MDe Amici, MGotti, CDallanoce, C Bifunctional compounds targeting both D2 and non-a7 nACh receptors: design, synthesis and pharmacological characterization. Eur J Med Chem101:367-83 (2015) 
 
Neuronal acetylcholine receptor subunit alpha-4/beta-2
Name:Neuronal acetylcholine receptor subunit alpha-4/beta-2
Type:Protein
Mol. Mass.:n/a
Description:n/a
Components:This complex has 2 components.
Component 1
Name:Neuronal acetylcholine receptor subunit alpha-4
Synonyms:ACHA4_HUMAN CHRNA4 protein Neuronal acetylcholine receptor protein alpha-4 subunit Nicotinic acetylcholine receptor alpha4/beta2/alpha5
Type:n/a
Mol. Mass.:69963.49
Organism:Homo sapiens (Human)
Description:NACHRA4
Residue:627
Component 2
Name:Neuronal acetylcholine receptor subunit beta-2
Synonyms:ACHB2_HUMAN Neuronal acetylcholine receptor protein beta-2 subunit | Nicotinic acetylcholine receptor alpha3/beta2/alpha5
Type:Protein
Mol. Mass.:57020.50
Organism:Homo sapiens (Human)
Description:P17787
Residue:502
BDBM50116299
NameBDBM50116299
Synonyms:CHEMBL3612360
TypeSmall organic molecule
Emp. Form.C30H46BrN3O2
Mol. Mass.560.609
SMILES[Br-].CN1CCC[C@H]1c1ccc[n+](CCCCCCCCCCNCC2CCc3ccc(O)cc3O2)c1