Reaction Details
Target5'-methylthioadenosine/S-adenosylhomocysteine nucleosidase
LigandBDBM50116357
Substrate/Competitorn/a
Meas. Tech.ChEMBL_1511512 (CHEMBL3606937)
Ki 4.5±n/a nM
Citation Evans, GBCameron, SALuxenburger, AGuan, RSuarez, JThomas, KSchramm, VLTyler, PC Tight binding enantiomers of pre-clinical drug candidates. Bioorg Med Chem23:5326-33 (2015) 
 
5'-methylthioadenosine/S-adenosylhomocysteine nucleosidase
Name:5'-methylthioadenosine/S-adenosylhomocysteine nucleosidase
Type:PROTEIN
Mol. Mass.:24362.21
Organism:Escherichia coli
Description:ChEMBL_109859
Residue:232
BDBM50116357
NameBDBM50116357
Synonyms:CHEMBL3604360
TypeSmall organic molecule
Emp. Form.C13H19N5OS
Mol. Mass.293.388
SMILESCSC[C@@H]1CN(Cc2c[nH]c3c(N)ncnc23)C[C@H]1O