Reaction Details
TargetCarbonic anhydrase 1
LigandBDBM50116363
Substrate/Competitorn/a
Meas. Tech.ChEMBL_1511757 (CHEMBL3607714)
Ki 2740±n/a nM
Citation Mollica, ACostante, RAkdemir, ACarradori, SStefanucci, AMacedonio, GCeruso, MSupuran, CT Exploring new Probenecid-based carbonic anhydrase inhibitors: Synthesis, biological evaluation and docking studies. Bioorg Med Chem23:5311-8 (2015) 
 
Carbonic anhydrase 1
Name:Carbonic anhydrase 1
Type:Enzyme
Mol. Mass.:28873.37
Organism:Homo sapiens (Human)
Description:P00915
Residue:261
BDBM50116363
NameBDBM50116363
Synonyms:CHEMBL3604514
TypeSmall organic molecule
Emp. Form.C16H25N3O4S2
Mol. Mass.387.517
SMILESCCCN(CCC)S(=O)(=O)c1ccc(cc1)C(=O)N[C@@H](CS)C(N)=O