Reaction Details
TargetCarbonic anhydrase 1
LigandBDBM50116365
Substrate/Competitorn/a
Meas. Tech.ChEMBL_1511757 (CHEMBL3607714)
Ki 304±n/a nM
Citation Mollica, ACostante, RAkdemir, ACarradori, SStefanucci, AMacedonio, GCeruso, MSupuran, CT Exploring new Probenecid-based carbonic anhydrase inhibitors: Synthesis, biological evaluation and docking studies. Bioorg Med Chem23:5311-8 (2015) 
 
Carbonic anhydrase 1
Name:Carbonic anhydrase 1
Type:Enzyme
Mol. Mass.:28873.37
Organism:Homo sapiens (Human)
Description:P00915
Residue:261
BDBM50116365
NameBDBM50116365
Synonyms:CHEMBL3604512
TypeSmall organic molecule
Emp. Form.C21H33F3N4O6S
Mol. Mass.526.57
SMILESOC(=O)C(F)(F)F.CCCN(CCC)S(=O)(=O)c1ccc(cc1)C(=O)N[C@@H](CCCCN)C(N)=O