Reaction Details
TargetCarbonic anhydrase 1
LigandBDBM50116360
Substrate/Competitorn/a
Meas. Tech.ChEMBL_1511757 (CHEMBL3607714)
Ki 7120±n/a nM
Citation Mollica, ACostante, RAkdemir, ACarradori, SStefanucci, AMacedonio, GCeruso, MSupuran, CT Exploring new Probenecid-based carbonic anhydrase inhibitors: Synthesis, biological evaluation and docking studies. Bioorg Med Chem23:5311-8 (2015) 
 
Carbonic anhydrase 1
Name:Carbonic anhydrase 1
Type:Enzyme
Mol. Mass.:28873.37
Organism:Homo sapiens (Human)
Description:P00915
Residue:261
BDBM50116360
NameBDBM50116360
Synonyms:CHEMBL3604405
TypeSmall organic molecule
Emp. Form.C16H24N2O5S
Mol. Mass.356.437
SMILESCCCN(CCC)S(=O)(=O)c1ccc(cc1)C(=O)N[C@@H](C)C(O)=O