Reaction Details
TargetCarbonic anhydrase 9
LigandBDBM50206509
Substrate/Competitorn/a
Meas. Tech.ChEMBL_1511810 (CHEMBL3608012)
Ki 360±n/a nM
Citation Mollica, ACostante, RAkdemir, ACarradori, SStefanucci, AMacedonio, GCeruso, MSupuran, CT Exploring new Probenecid-based carbonic anhydrase inhibitors: Synthesis, biological evaluation and docking studies. Bioorg Med Chem23:5311-8 (2015) 
 
Carbonic anhydrase 9
Name:Carbonic anhydrase 9
Type:Enzyme
Mol. Mass.:49669.03
Organism:Homo sapiens (Human)
Description:Catalytic domain of human cloned isozyme was used in the assay
Residue:459
BDBM50206509
NameBDBM50206509
Synonyms:4-Dipropylsulfamoyl-benzoic acid 4-Dipropylsulfamoyl-benzoic acid(probenecid) CHEMBL897 Probalan
TypeSmall organic molecule
Emp. Form.C13H19NO4S
Mol. Mass.285.359
SMILESCCCN(CCC)S(=O)(=O)c1ccc(cc1)C(O)=O