Reaction Details
TargetCarbonic anhydrase 2
LigandBDBM50116439
Substrate/Competitorn/a
Meas. Tech.ChEMBL_1511809 (CHEMBL3608011)
Ki 507±n/a nM
Citation Mollica, ACostante, RAkdemir, ACarradori, SStefanucci, AMacedonio, GCeruso, MSupuran, CT Exploring new Probenecid-based carbonic anhydrase inhibitors: Synthesis, biological evaluation and docking studies. Bioorg Med Chem23:5311-8 (2015) 
 
Carbonic anhydrase 2
Name:Carbonic anhydrase 2
Type:Enzyme
Mol. Mass.:29250.71
Organism:Homo sapiens (Human)
Description:P00918
Residue:260
BDBM50116439
NameBDBM50116439
Synonyms:CHEMBL3604413
TypeSmall organic molecule
Emp. Form.C21H32F3N5O7S
Mol. Mass.555.568
SMILESOC(=O)C(F)(F)F.CCCN(CCC)S(=O)(=O)c1ccc(cc1)C(=O)N[C@@H](CCCNC(N)=N)C(O)=O