Reaction Details
TargetMetabotropic glutamate receptor 8
LigandBDBM50116512
Substrate/Competitorn/a
Meas. Tech.ChEMBL_1512622 (CHEMBL3610759)
IC50>30000±n/a nM
Citation Zhang, ZKil, KEPoutiainen, PChoi, JKKang, HJHuang, XPRoth, BLBrownell, AL Re-exploring the N-phenylpicolinamide derivatives to develop mGlu4 ligands with improved affinity and in vitro microsomal stability. Bioorg Med Chem Lett25:3956-60 (2015) 
 
Metabotropic glutamate receptor 8
Name:Metabotropic glutamate receptor 8
Type:Enzyme Catalytic Domain
Mol. Mass.:101759.58
Organism:Homo sapiens (Human)
Description:metabotropic glutamate 8 GRM8 HUMAN::O00222
Residue:908
BDBM50116512
NameBDBM50116512
Synonyms:CHEMBL3609741
TypeSmall organic molecule
Emp. Form.C13H10ClFN2O2
Mol. Mass.280.682
SMILESFCOc1cc(NC(=O)c2ccccn2)ccc1Cl