Reaction Details
TargetVoltage-dependent L-type calcium channel subunit alpha-1C
LigandBDBM50116528
Substrate/Competitorn/a
Meas. Tech.ChEMBL_1512774 (CHEMBL3611367)
IC50 140±n/a nM
Citation Renneberg, DHubler, FRey, MHess, PDelahaye, SGatfield, JIglarz, MHilpert, K Discovery of novel bridged tetrahydronaphthalene derivatives as potent T/L-type calcium channel blockers. Bioorg Med Chem Lett25:3941-6 (2015) 
 
Voltage-dependent L-type calcium channel subunit alpha-1C
Name:Voltage-dependent L-type calcium channel subunit alpha-1C
Type:Enzyme Catalytic Domain
Mol. Mass.:248979.79
Organism:Homo sapiens (Human)
Description:Calcium channel (Type L) 0 HUMAN::Q13936
Residue:2221
BDBM50116528
NameBDBM50116528
Synonyms:CHEMBL3608946
TypeSmall organic molecule
Emp. Form.C29H35N3O2
Mol. Mass.457.6071
SMILES[H][C@@]12CC[C@@]([H])(c3ccccc13)[C@@](CCN(C)CCCc1nc3ccccc3[nH]1)(C2)OC(=O)C1CC1